Information card for entry 4307338
Formula | C32 H28 Fe N O S4 |
Calculated formula | C32 H28 Fe N O S4 |
Title of publication | Electronic Structure of Nitric Oxide Adducts of Bis(diaryl-1,2-dithiolene)iron Compounds: Four-Membered Electron-Transfer Series [Fe(NO)(L)2]z (z= 1+, 0, 1-, 2-) |
Authors of publication | Prasanta Ghosh; Keira Stobie; Eckhard Bill; Eberhard Bothe; Thomas Weyhermüller; Michael D. Ward; Jon A. McCleverty; Karl Wieghardt |
Journal of publication | Inorganic Chemistry |
Year of publication | 2007 |
Journal volume | 46 |
Pages of publication | 522 - 532 |
a | 17.0132 ± 0.0005 Å |
b | 21.5449 ± 0.0006 Å |
c | 16.204 ± 0.0005 Å |
α | 90° |
β | 90° |
γ | 90° |
Cell volume | 5939.5 ± 0.3 Å3 |
Cell temperature | 100 ± 2 K |
Ambient diffraction temperature | 100 ± 2 K |
Number of distinct elements | 6 |
Space group number | 60 |
Hermann-Mauguin space group symbol | P b c n |
Hall space group symbol | -P 2n 2ab |
Residual factor for all reflections | 0.0858 |
Residual factor for significantly intense reflections | 0.0666 |
Weighted residual factors for significantly intense reflections | 0.1236 |
Weighted residual factors for all reflections included in the refinement | 0.1303 |
Goodness-of-fit parameter for all reflections included in the refinement | 1.202 |
Diffraction radiation wavelength | 0.71073 Å |
Diffraction radiation type | MoKα |