Information card for entry 4307418
Formula | C15 H12 Co2 N6 O8 |
Calculated formula | C15 H9 Co2 N6 O8 |
Title of publication | Self-Assembled Cationic Heterochiral Honeycomb-Layered Metal Complexes with the in Situ Generated Pyrimidine-2-carboxylato Bisdidentate Ligand. Hydrothermal Synthesis, Crystal Structures, Magnetic Properties, and Theoretical Study of [M2(μ-pymca)3]OH.H2O (M = FeII, CoII) |
Authors of publication | Antonio Rodríguez-Diéguez; Joan Cano; Raikko Kivekäs; Abderrahmane Debdoubi; Enrique Colacio |
Journal of publication | Inorganic Chemistry |
Year of publication | 2007 |
Journal volume | 46 |
Pages of publication | 2503 - 2510 |
a | 9.548 ± 0.005 Å |
b | 9.548 ± 0.005 Å |
c | 6.077 ± 0.005 Å |
α | 90° |
β | 90° |
γ | 120° |
Cell volume | 479.8 ± 0.5 Å3 |
Cell temperature | 153 ± 2 K |
Ambient diffraction temperature | 153 ± 2 K |
Number of distinct elements | 5 |
Space group number | 157 |
Hermann-Mauguin space group symbol | P 3 1 m |
Hall space group symbol | P 3 -2 |
Residual factor for all reflections | 0.0825 |
Residual factor for significantly intense reflections | 0.0704 |
Weighted residual factors for significantly intense reflections | 0.1878 |
Weighted residual factors for all reflections included in the refinement | 0.2005 |
Goodness-of-fit parameter for all reflections included in the refinement | 1.144 |
Diffraction radiation wavelength | 0.71073 Å |
Diffraction radiation type | MoKα |