Information card for entry 4307569
Formula | C29 H24 Cl2 Fe N12 O9 |
Calculated formula | C29 H20 Cl2 Fe N12 O9 |
Title of publication | Spin Crossover in a Series of Iron(II) Complexes of 2-(2-Alkyl-2H-tetrazol-5-yl)-1,10-phenanthroline: Effects of Alkyl Side Chain, Solvent, and Anion |
Authors of publication | Wen Zhang; Fei Zhao; Tao Liu; Mei Yuan; Zhe-Ming Wang; Song Gao |
Journal of publication | Inorganic Chemistry |
Year of publication | 2007 |
Journal volume | 46 |
Pages of publication | 2541 - 2555 |
a | 19.7302 ± 0.0004 Å |
b | 10.949 ± 0.0002 Å |
c | 17.1696 ± 0.0003 Å |
α | 90° |
β | 113.856 ± 0.0009° |
γ | 90° |
Cell volume | 3392.18 ± 0.11 Å3 |
Cell temperature | 293 ± 2 K |
Ambient diffraction temperature | 293 ± 2 K |
Number of distinct elements | 6 |
Space group number | 13 |
Hermann-Mauguin space group symbol | P 1 2/c 1 |
Hall space group symbol | -P 2yc |
Residual factor for all reflections | 0.1395 |
Residual factor for significantly intense reflections | 0.0603 |
Weighted residual factors for significantly intense reflections | 0.1539 |
Weighted residual factors for all reflections included in the refinement | 0.1796 |
Goodness-of-fit parameter for all reflections included in the refinement | 1.01 |
Diffraction radiation wavelength | 0.71073 Å |
Diffraction radiation type | MoKα |