Information card for entry 4307572
Formula | C30 H26 B2 F8 Fe N12 O |
Calculated formula | C30 H24 B1.348 F8 Fe N12 O |
Title of publication | Spin Crossover in a Series of Iron(II) Complexes of 2-(2-Alkyl-2H-tetrazol-5-yl)-1,10-phenanthroline: Effects of Alkyl Side Chain, Solvent, and Anion |
Authors of publication | Wen Zhang; Fei Zhao; Tao Liu; Mei Yuan; Zhe-Ming Wang; Song Gao |
Journal of publication | Inorganic Chemistry |
Year of publication | 2007 |
Journal volume | 46 |
Pages of publication | 2541 - 2555 |
a | 10.7053 ± 0.0003 Å |
b | 10.9912 ± 0.0003 Å |
c | 14.9959 ± 0.0005 Å |
α | 76.15 ± 0.001° |
β | 84.2 ± 0.002° |
γ | 83.298 ± 0.002° |
Cell volume | 1696.57 ± 0.09 Å3 |
Cell temperature | 293 ± 2 K |
Ambient diffraction temperature | 293 ± 2 K |
Number of distinct elements | 7 |
Space group number | 2 |
Hermann-Mauguin space group symbol | P -1 |
Hall space group symbol | -P 1 |
Residual factor for all reflections | 0.1713 |
Residual factor for significantly intense reflections | 0.0588 |
Weighted residual factors for significantly intense reflections | 0.129 |
Weighted residual factors for all reflections included in the refinement | 0.1563 |
Goodness-of-fit parameter for all reflections included in the refinement | 0.905 |
Diffraction radiation wavelength | 0.71073 Å |
Diffraction radiation type | MoKα |