Information card for entry 4307582
Formula | Eu K O3 Pd |
Calculated formula | Eu K O3 Pd |
Title of publication | Crystal Growth and Structural Characterization of the New Ordered Palladates LnKPdO3 (Ln = La, Pr, Nd, Sm-Gd) and the Isostructural, Partially Cu-Substituted Palladate PrK(Cu0.14Pd0.86)O3 |
Authors of publication | Samuel J. Mugavero; Mark D. Smith; Hans-Conrad zur Loye |
Journal of publication | Inorganic Chemistry |
Year of publication | 2007 |
Journal volume | 46 |
Pages of publication | 3116 - 3122 |
a | 13.0582 ± 0.0005 Å |
b | 3.9198 ± 0.0002 Å |
c | 7.3298 ± 0.0003 Å |
α | 90° |
β | 104.562 ± 0.001° |
γ | 90° |
Cell volume | 363.13 ± 0.03 Å3 |
Cell temperature | 294 ± 2 K |
Ambient diffraction temperature | 294 ± 2 K |
Number of distinct elements | 4 |
Space group number | 12 |
Hermann-Mauguin space group symbol | C 1 2/m 1 |
Hall space group symbol | -C 2y |
Residual factor for all reflections | 0.0248 |
Residual factor for significantly intense reflections | 0.0239 |
Weighted residual factors for significantly intense reflections | 0.0602 |
Weighted residual factors for all reflections included in the refinement | 0.0607 |
Goodness-of-fit parameter for all reflections included in the refinement | 1.148 |
Diffraction radiation wavelength | 0.71073 Å |
Diffraction radiation type | MoKα |