Information card for entry 4307651
Formula | C8 Cl2 Cu D8 N4 O8 |
Calculated formula | C8 Cl2 Cu D8 N4 O8 |
Title of publication | Two-Dimensional Heisenberg Antiferromagnets: Syntheses, X-ray Structures, and Magnetic Behavior of [Cu(pz)2](ClO4)2, [Cu(pz)2](BF4)2, and [Cu(pz)2(NO3)](PF6) |
Authors of publication | F. Matthew Woodward; Pamela J. Gibson; Geoffrey B. Jameson; Christopher P. Landee; Mark M. Turnbull; Roger D. Willett |
Journal of publication | Inorganic Chemistry |
Year of publication | 2007 |
Journal volume | 46 |
Pages of publication | 4256 - 4266 |
a | 14.045 ± 0.005 Å |
b | 9.759 ± 0.003 Å |
c | 9.8 ± 0.003 Å |
α | 90° |
β | 96.491 ± 0.004° |
γ | 90° |
Cell volume | 1334.6 ± 0.7 Å3 |
Cell temperature | 163 ± 2 K |
Ambient diffraction temperature | 163 ± 2 K |
Number of distinct elements | 6 |
Space group number | 15 |
Hermann-Mauguin space group symbol | C 1 2/c 1 |
Hall space group symbol | -C 2yc |
Residual factor for all reflections | 0.0351 |
Residual factor for significantly intense reflections | 0.0347 |
Weighted residual factors for significantly intense reflections | 0.0974 |
Weighted residual factors for all reflections included in the refinement | 0.0976 |
Goodness-of-fit parameter for all reflections included in the refinement | 1.191 |
Diffraction radiation wavelength | 0.71073 Å |
Diffraction radiation type | MoKα |