Information card for entry 4307703
Formula | C28 H40 Au2 Cl5 F24 N4 O8 P4 Rh |
Calculated formula | C28 H40 Au2 Cl5 F24 N4 O8 P4 Rh |
SMILES | [Au]12([Rh](Cl)([P](N([P]1(OCC(F)(F)F)OCC(F)(F)F)C)(OCC(F)(F)F)OCC(F)(F)F)([P](N([P]2(OCC(F)(F)F)OCC(F)(F)F)C)(OCC(F)(F)F)OCC(F)(F)F)(C#[N]C(C)(C)C)C#[N]C(C)(C)C)(Cl)Cl.[Au](Cl)[Cl-] |
Title of publication | A RhII-AuII Bimetallic Core with a Direct Metal-Metal Bond |
Authors of publication | Arthur J. Esswein; Jillian L. Dempsey; Daniel G. Nocera |
Journal of publication | Inorganic Chemistry |
Year of publication | 2007 |
Journal volume | 46 |
Pages of publication | 2362 - 2364 |
a | 16.111 ± 0.003 Å |
b | 20.119 ± 0.003 Å |
c | 17.299 ± 0.003 Å |
α | 90° |
β | 92.803 ± 0.003° |
γ | 90° |
Cell volume | 5600.5 ± 1.7 Å3 |
Cell temperature | 100 ± 2 K |
Ambient diffraction temperature | 100 ± 2 K |
Number of distinct elements | 9 |
Space group number | 14 |
Hermann-Mauguin space group symbol | P 1 21/n 1 |
Hall space group symbol | -P 2yn |
Residual factor for all reflections | 0.0347 |
Residual factor for significantly intense reflections | 0.0299 |
Weighted residual factors for significantly intense reflections | 0.0751 |
Weighted residual factors for all reflections included in the refinement | 0.0773 |
Goodness-of-fit parameter for all reflections included in the refinement | 1.018 |
Diffraction radiation wavelength | 0.71073 Å |
Diffraction radiation type | MoKα |