Information card for entry 4307731
Formula | C37 H46 Cl2 Cu2 N8 O20 |
Calculated formula | C37 H46 Cl2 Cu2 N8 O20 |
Title of publication | Synthesis and Characterization of Copper(II) Complexes of Nonfacially Coordinating Heteroscorpionate Ligands (4-Carboxyphenyl)bis(3,5-dimethylpyrazolyl)methane and (3-Carboxyphenyl)bis(3,5-dimethylpyrazolyl)methane |
Authors of publication | Guillermo A. Santillan; Carl J. Carrano |
Journal of publication | Inorganic Chemistry |
Year of publication | 2007 |
Journal volume | 46 |
Pages of publication | 1751 - 1759 |
a | 16.8155 ± 0.0008 Å |
b | 15.5036 ± 0.0007 Å |
c | 18.9048 ± 0.0008 Å |
α | 90° |
β | 100.917 ± 0.002° |
γ | 90° |
Cell volume | 4839.3 ± 0.4 Å3 |
Cell temperature | 200 ± 2 K |
Ambient diffraction temperature | 200 ± 2 K |
Number of distinct elements | 6 |
Space group number | 14 |
Hermann-Mauguin space group symbol | P 1 21/c 1 |
Hall space group symbol | -P 2ybc |
Residual factor for all reflections | 0.0818 |
Residual factor for significantly intense reflections | 0.0586 |
Weighted residual factors for significantly intense reflections | 0.1746 |
Weighted residual factors for all reflections included in the refinement | 0.1932 |
Goodness-of-fit parameter for all reflections included in the refinement | 1.076 |
Diffraction radiation wavelength | 0.71073 Å |
Diffraction radiation type | MoKα |