Information card for entry 4307848
Formula | C25 H24 Cl F6 N4 Os P |
Calculated formula | C25 H24 Cl F6 N4 Os P |
SMILES | [Os]123456(Cl)([N](=Nc7[n]1cccc7)c1ccc(N(C)C)cc1)[c]1([cH]2[cH]3[cH]4[cH]5[cH]61)c1ccccc1.[P](F)(F)(F)(F)(F)[F-] |
Title of publication | Chloro Half-Sandwich Osmium(II) Complexes: Influence of Chelated N,N-Ligands on Hydrolysis, Guanine Binding, and Cytotoxicity |
Authors of publication | Anna F. A. Peacock; Abraha Habtemariam; Stephen A. Moggach; Alessandro Prescimone; Simon Parsons; Peter J. Sadler |
Journal of publication | Inorganic Chemistry |
Year of publication | 2007 |
Journal volume | 46 |
Pages of publication | 4049 - 4059 |
a | 8.1226 ± 0.0003 Å |
b | 10.0165 ± 0.0004 Å |
c | 17.3516 ± 0.0006 Å |
α | 101.105 ± 0.002° |
β | 96.365 ± 0.002° |
γ | 109.271 ± 0.002° |
Cell volume | 1284.28 ± 0.09 Å3 |
Cell temperature | 150 K |
Ambient diffraction temperature | 150 K |
Number of distinct elements | 7 |
Space group number | 2 |
Hermann-Mauguin space group symbol | P -1 |
Hall space group symbol | -P 1 |
Residual factor for all reflections | 0.0389 |
Residual factor for significantly intense reflections | 0.034 |
Weighted residual factors for all reflections | 0.0769 |
Weighted residual factors for significantly intense reflections | 0.0749 |
Weighted residual factors for all reflections included in the refinement | 0.0769 |
Goodness-of-fit parameter for all reflections included in the refinement | 0.9409 |
Diffraction radiation wavelength | 0.71073 Å |
Diffraction radiation type | MoKα |