Information card for entry 4307882
Formula | C24 H32 B2 F8 Fe N6 O2 |
Calculated formula | C24 H32 B2 F8 Fe N6 O2 |
Title of publication | Remarkable Steric Effects and Influence of Monodentate Axial Ligands L on the Spin-Crossover Properties of trans-[FeII(N4ligand)L] Complexes |
Authors of publication | José Sánchez Costa; Kristian Lappalainen; Graham de Ruiter; Manuel Quesada; Jinkui Tang; Ilpo Mutikainen; Urho Turpeinen; C. Matthias Grunert; Philipp Gütlich; Hanane Zhor Lazar; Jean-François Létard; Patrick Gamez; Jan Reedijk |
Journal of publication | Inorganic Chemistry |
Year of publication | 2007 |
Journal volume | 46 |
Pages of publication | 4079 - 4089 |
a | 8.936 ± 0.002 Å |
b | 11.823 ± 0.002 Å |
c | 14.563 ± 0.003 Å |
α | 73.17 ± 0.02° |
β | 79.54 ± 0.02° |
γ | 86.84 ± 0.02° |
Cell volume | 1448.2 ± 0.5 Å3 |
Cell temperature | 173 ± 2 K |
Ambient diffraction temperature | 173 ± 2 K |
Number of distinct elements | 7 |
Space group number | 2 |
Hermann-Mauguin space group symbol | P -1 |
Hall space group symbol | -P 1 |
Residual factor for all reflections | 0.0676 |
Residual factor for significantly intense reflections | 0.046 |
Weighted residual factors for significantly intense reflections | 0.118 |
Weighted residual factors for all reflections included in the refinement | 0.1285 |
Goodness-of-fit parameter for all reflections included in the refinement | 1.025 |
Diffraction radiation wavelength | 0.71073 Å |
Diffraction radiation type | MoKα |