Information card for entry 4307913
Formula | C15 H33 B10 Co |
Calculated formula | C15 H33 B10 Co |
SMILES | [Co]123456789([CH]%10%11[B]%12%136(C)[CH]6%141[B]1%15%13(C)[B]%13%16%11%12(C)[B]%117%10(C)[BH]7%108[BH]8%13%11[B]%111%16(C)[B]1%14%15(C)[B]967(C)[B]%108%111C)[cH]1[cH]2[cH]3[cH]4[cH]51 |
Title of publication | Synthesis, Structure, Reactivity, and Thermal Isomerization of Boron-Substituted 13-Vertex Cobaltacarboranes (η5-Cp)Co(η6-R2C2B10Me8H2) (R = H, Et) |
Authors of publication | Liang Deng; Hoi-Shan Chan; Zuowei Xie |
Journal of publication | Inorganic Chemistry |
Year of publication | 2007 |
Journal volume | 46 |
Pages of publication | 2716 - 2724 |
a | 10.063 ± 0.003 Å |
b | 16.035 ± 0.005 Å |
c | 13.155 ± 0.004 Å |
α | 90° |
β | 97.662 ± 0.007° |
γ | 90° |
Cell volume | 2103.7 ± 1.1 Å3 |
Cell temperature | 293 ± 2 K |
Ambient diffraction temperature | 293 ± 2 K |
Number of distinct elements | 4 |
Space group number | 14 |
Hermann-Mauguin space group symbol | P 1 21/n 1 |
Hall space group symbol | -P 2yn |
Residual factor for all reflections | 0.1072 |
Residual factor for significantly intense reflections | 0.0496 |
Weighted residual factors for significantly intense reflections | 0.1226 |
Weighted residual factors for all reflections included in the refinement | 0.1547 |
Goodness-of-fit parameter for all reflections included in the refinement | 1.003 |
Diffraction radiation wavelength | 0.71073 Å |
Diffraction radiation type | MoKα |