Information card for entry 4307983
Formula | C30 H54 Cl2 F6 N2 O18 P4 Ru2 S4 |
Calculated formula | C30 H54 Cl2 F6 N2 O18 P4 Ru2 S4 |
SMILES | CO[P]([Ru]123([Cl][Ru]([S]4[S]1CC(=C(C4)C)C)([P](OC)(OC)OC)([Cl]2)([P](OC)(OC)OC)[N]#CCc1cc(ccc1)CC#[N]3)[P](OC)(OC)OC)(OC)OC.C(S(=O)(=O)[O-])(F)(F)F.S(=O)(=O)([O-])C(F)(F)F |
Title of publication | C-H Cleavage and Double Alkyl Additions to the Disulfido Ligand in Dicyanido-Bridged Ru2S2 Complexes |
Authors of publication | Sumito Ishizu; Hiroyasu Sugiyama; Brian K. Breedlove; Kazuko Matsumoto |
Journal of publication | Inorganic Chemistry |
Year of publication | 2007 |
Journal volume | 46 |
Pages of publication | 3726 - 3735 |
a | 8.982 ± 0.006 Å |
b | 13.158 ± 0.008 Å |
c | 23.18 ± 0.014 Å |
α | 104.245 ± 0.012° |
β | 97.383 ± 0.011° |
γ | 96.312 ± 0.012° |
Cell volume | 2605 ± 3 Å3 |
Cell temperature | 293 ± 2 K |
Ambient diffraction temperature | 293 ± 2 K |
Number of distinct elements | 9 |
Space group number | 2 |
Hermann-Mauguin space group symbol | P -1 |
Hall space group symbol | -P 1 |
Residual factor for all reflections | 0.1177 |
Residual factor for significantly intense reflections | 0.0704 |
Weighted residual factors for significantly intense reflections | 0.1839 |
Weighted residual factors for all reflections included in the refinement | 0.2198 |
Goodness-of-fit parameter for all reflections included in the refinement | 1.067 |
Diffraction radiation wavelength | 0.71073 Å |
Diffraction radiation type | MoKα |