Information card for entry 4307989
Formula | C28 H50 Cl2 F6 N2 O18 P4 Ru2 S4 |
Calculated formula | C28 H50 Cl2 F6 N2 O18 P4 Ru2 S4 |
SMILES | CO[P]([Ru]123([Cl][Ru]([Cl]1)([S]1[S]2CC=CC1)([P](OC)(OC)OC)([P](OC)(OC)OC)[N]#CCc1cc(ccc1)CC#[N]3)[P](OC)(OC)OC)(OC)OC.S(=O)(=O)(C(F)(F)F)[O-].S(=O)(=O)([O-])C(F)(F)F |
Title of publication | C-H Cleavage and Double Alkyl Additions to the Disulfido Ligand in Dicyanido-Bridged Ru2S2 Complexes |
Authors of publication | Sumito Ishizu; Hiroyasu Sugiyama; Brian K. Breedlove; Kazuko Matsumoto |
Journal of publication | Inorganic Chemistry |
Year of publication | 2007 |
Journal volume | 46 |
Pages of publication | 3726 - 3735 |
a | 8.8148 ± 0.0012 Å |
b | 12.4503 ± 0.0017 Å |
c | 23.23 ± 0.003 Å |
α | 102.872 ± 0.003° |
β | 98.455 ± 0.002° |
γ | 94.801 ± 0.002° |
Cell volume | 2440.4 ± 0.6 Å3 |
Cell temperature | 120 ± 2 K |
Ambient diffraction temperature | 120 ± 2 K |
Number of distinct elements | 9 |
Space group number | 2 |
Hermann-Mauguin space group symbol | P -1 |
Hall space group symbol | -P 1 |
Residual factor for all reflections | 0.0539 |
Residual factor for significantly intense reflections | 0.0448 |
Weighted residual factors for significantly intense reflections | 0.1122 |
Weighted residual factors for all reflections included in the refinement | 0.1186 |
Goodness-of-fit parameter for all reflections included in the refinement | 1.047 |
Diffraction radiation wavelength | 0.71073 Å |
Diffraction radiation type | MoKα |