Information card for entry 4308001
Common name | compound 5, Hg(C5Me4SiMe3)2 |
Formula | C24 H42 Hg Si2 |
Calculated formula | C24 H42 Hg Si2 |
Title of publication | Solid-State Structures and Solution Studies of Novel Cyclopentadienyl Mercury Compounds |
Authors of publication | Abdessamad Grirrane; Irene Resa; Diego del Río; Amor Rodríguez; Eleuterio Álvarez; Kurt Mereiter; Ernesto Carmona |
Journal of publication | Inorganic Chemistry |
Year of publication | 2007 |
Journal volume | 46 |
Pages of publication | 4667 - 4676 |
a | 8.7264 ± 0.0013 Å |
b | 11.3098 ± 0.0016 Å |
c | 22.744 ± 0.003 Å |
α | 93.496 ± 0.002° |
β | 99.672 ± 0.002° |
γ | 111.419 ± 0.002° |
Cell volume | 2041.6 ± 0.5 Å3 |
Cell temperature | 173 ± 2 K |
Ambient diffraction temperature | 173 ± 2 K |
Number of distinct elements | 4 |
Space group number | 2 |
Hermann-Mauguin space group symbol | P -1 |
Hall space group symbol | -P 1 |
Residual factor for all reflections | 0.0348 |
Residual factor for significantly intense reflections | 0.024 |
Weighted residual factors for significantly intense reflections | 0.0468 |
Weighted residual factors for all reflections included in the refinement | 0.0493 |
Goodness-of-fit parameter for all reflections included in the refinement | 1.027 |
Diffraction radiation wavelength | 0.71073 Å |
Diffraction radiation type | MoKα |