Information card for entry 4308159
Formula | C83 H129 Au2 Cl2 N2 O9 P2 Pd S2 |
Calculated formula | C83 H129 Au2 Cl2 N2 O9 P2 Pd S2 |
Title of publication | Synthesis, Structure, and Luminescence of Di- and Trinuclear Palladium/Gold and Platinum/Gold Complexes with (2,7-Di-tert-butylfluoren-9-ylidene)methanedithiolate,1 |
Authors of publication | José Vicente; Pablo González-Herrero; María Pérez-Cadenas; Peter G. Jones; Delia Bautista |
Journal of publication | Inorganic Chemistry |
Year of publication | 2007 |
Journal volume | 46 |
Pages of publication | 4718 - 4732 |
a | 22.6833 ± 0.0009 Å |
b | 14.445 ± 0.0006 Å |
c | 28.7838 ± 0.0012 Å |
α | 90° |
β | 112.831 ± 0.002° |
γ | 90° |
Cell volume | 8692.4 ± 0.6 Å3 |
Cell temperature | 100 ± 2 K |
Ambient diffraction temperature | 100 ± 2 K |
Number of distinct elements | 9 |
Space group number | 14 |
Hermann-Mauguin space group symbol | P 1 21/n 1 |
Hall space group symbol | -P 2yn |
Residual factor for all reflections | 0.0449 |
Residual factor for significantly intense reflections | 0.0313 |
Weighted residual factors for significantly intense reflections | 0.0682 |
Weighted residual factors for all reflections included in the refinement | 0.0731 |
Goodness-of-fit parameter for all reflections included in the refinement | 1.024 |
Diffraction radiation wavelength | 0.71073 Å |
Diffraction radiation type | MoKα |