Information card for entry 4308165
Formula | C21 H23 Cl2 N3 O8 Pb S2 |
Calculated formula | C21 H23 Cl2 N3 O8 Pb S2 |
SMILES | [Pb]1234[S]5CC[N]3(CC[S]2Cc2[n]1c(ccc2)C5)Cc1[n]4c2c(cc1)cccc2.Cl(=O)(=O)(=O)[O-].Cl(=O)(=O)(=O)[O-] |
Title of publication | Tuning the Selectivity/Specificity of Fluorescent Metal Ion Sensors Based on N2S2 Pyridine-Containing Macrocyclic Ligands by Changing the Fluorogenic Subunit: Spectrofluorimetric and Metal Ion Binding Studies |
Authors of publication | M. Carla Aragoni; Massimiliano Arca; Andrea Bencini; Alexander J. Blake; Claudia Caltagirone; Greta De Filippo; Francesco A. Devillanova; Alessandra Garau; Thomas Gelbrich; Michael B. Hursthouse; Francesco Isaia; Vito Lippolis; Marta Mameli; Palma Mariani; Barbara Valtancoli; Claire Wilson |
Journal of publication | Inorganic Chemistry |
Year of publication | 2007 |
Journal volume | 46 |
Pages of publication | 4548 - 4559 |
a | 9.4031 ± 0.0008 Å |
b | 20.719 ± 0.002 Å |
c | 12.8426 ± 0.0011 Å |
α | 90° |
β | 90.956 ± 0.002° |
γ | 90° |
Cell volume | 2501.7 ± 0.4 Å3 |
Cell temperature | 150 ± 2 K |
Ambient diffraction temperature | 150 ± 2 K |
Number of distinct elements | 7 |
Space group number | 14 |
Hermann-Mauguin space group symbol | P 1 21/n 1 |
Hall space group symbol | -P 2yn |
Residual factor for all reflections | 0.032 |
Residual factor for significantly intense reflections | 0.0231 |
Weighted residual factors for significantly intense reflections | 0.0499 |
Weighted residual factors for all reflections included in the refinement | 0.0529 |
Goodness-of-fit parameter for all reflections included in the refinement | 1.04 |
Diffraction radiation wavelength | 0.71073 Å |
Diffraction radiation type | MoKα |