Information card for entry 4308167
Formula | C21 H25 Cl2 N3 O9 S2 Zn |
Calculated formula | C21 H25 Cl2 N3 O9 S2 Zn |
SMILES | [Zn]1234([S]5CC[N]3(CC[S]1Cc1[n]2c(ccc1)C5)Cc1[n]4c2c(cc1)cccc2)[OH2].Cl(=O)(=O)(=O)[O-].Cl(=O)(=O)(=O)[O-] |
Title of publication | Tuning the Selectivity/Specificity of Fluorescent Metal Ion Sensors Based on N2S2 Pyridine-Containing Macrocyclic Ligands by Changing the Fluorogenic Subunit: Spectrofluorimetric and Metal Ion Binding Studies |
Authors of publication | M. Carla Aragoni; Massimiliano Arca; Andrea Bencini; Alexander J. Blake; Claudia Caltagirone; Greta De Filippo; Francesco A. Devillanova; Alessandra Garau; Thomas Gelbrich; Michael B. Hursthouse; Francesco Isaia; Vito Lippolis; Marta Mameli; Palma Mariani; Barbara Valtancoli; Claire Wilson |
Journal of publication | Inorganic Chemistry |
Year of publication | 2007 |
Journal volume | 46 |
Pages of publication | 4548 - 4559 |
a | 12.3734 ± 0.001 Å |
b | 14.1375 ± 0.0012 Å |
c | 14.9149 ± 0.0012 Å |
α | 90° |
β | 96.326 ± 0.001° |
γ | 90° |
Cell volume | 2593.2 ± 0.4 Å3 |
Cell temperature | 150 ± 2 K |
Ambient diffraction temperature | 150 ± 2 K |
Number of distinct elements | 7 |
Space group number | 14 |
Hermann-Mauguin space group symbol | P 1 21/c 1 |
Hall space group symbol | -P 2ybc |
Residual factor for all reflections | 0.0419 |
Residual factor for significantly intense reflections | 0.04 |
Weighted residual factors for significantly intense reflections | 0.0931 |
Weighted residual factors for all reflections included in the refinement | 0.0941 |
Goodness-of-fit parameter for all reflections included in the refinement | 1.167 |
Diffraction radiation wavelength | 0.71073 Å |
Diffraction radiation type | MoKα |