Information card for entry 4308171
Common name | Fe(4ditz)3(PF6)2.0.75(CH3OH) xx2 |
Chemical name | [mue-tris(1,4-bis(tetrazol-1-yl)butane-N4,N4')iron(II)] bis(hexafluorophosphate solvate (methanol) |
Formula | C18.75 H33 F12 Fe N24 O0.75 P2 |
Calculated formula | C18.786 H30 F12 Fe N24 O0.786 P2 |
Title of publication | Modification of Spin Crossover Behavior through Solvent Assisted Formation and Solvent Inclusion in a Triply Interpenetrating Three-Dimensional Network |
Authors of publication | Matthias Bartel; Alina Absmeier; Guy N. L. Jameson; Franz Werner; Kenichi Kato; Masaki Takata; Roman Boca; Miki Hasegawa; Kurt Mereiter; Andrea Caneschi; Wolfgang Linert |
Journal of publication | Inorganic Chemistry |
Year of publication | 2007 |
Journal volume | 46 |
Pages of publication | 4220 - 4229 |
a | 10.9686 ± 0.0003 Å |
b | 10.9686 ± 0.0003 Å |
c | 8.6941 ± 0.0005 Å |
α | 90° |
β | 90° |
γ | 120° |
Cell volume | 905.85 ± 0.06 Å3 |
Cell temperature | 100 ± 2 K |
Ambient diffraction temperature | 100 ± 2 K |
Number of distinct elements | 7 |
Space group number | 147 |
Hermann-Mauguin space group symbol | P -3 |
Hall space group symbol | -P 3 |
Residual factor for all reflections | 0.0216 |
Residual factor for significantly intense reflections | 0.0215 |
Weighted residual factors for significantly intense reflections | 0.0552 |
Weighted residual factors for all reflections included in the refinement | 0.0553 |
Goodness-of-fit parameter for all reflections included in the refinement | 1.059 |
Diffraction radiation wavelength | 0.71073 Å |
Diffraction radiation type | MoKα |