Information card for entry 4308208
Common name | (7) [Sm(m-ONep)2(ONep)]4 |
Formula | C60 H132 O12 Sm4 |
Calculated formula | C60 H132 O12 Sm4 |
SMILES | C(C(C)(C)C)O[Sm]123[O](CC(C)(C)C)[Sm]4(OCC(C)(C)C)([O](CC(C)(C)C)[Sm]5(OCC(C)(C)C)([O](CC(C)(C)C)[Sm]([O]1CC(C)(C)C)(OCC(C)(C)C)([O]2CC(C)(C)C)[O]5CC(C)(C)C)[O]4CC(C)(C)C)[O]3CC(C)(C)C |
Title of publication | Isostructural neo-Pentoxide Derivatives of Group 3 and the Lanthanide Series Metals for the Production of Ln2O3 Nanoparticles |
Authors of publication | Timothy J. Boyle; Leigh Anna M. Ottley; Sherrika D. Daniel-Taylor; Louis J. Tribby; Scott D. Bunge; Alison L. Costello; Todd M. Alam; John C. Gordon; T. Mark MCleskey |
Journal of publication | Inorganic Chemistry |
Year of publication | 2007 |
Journal volume | 46 |
Pages of publication | 3705 - 3713 |
a | 18.2051 ± 0.0018 Å |
b | 18.2051 ± 0.0018 Å |
c | 11.749 ± 0.002 Å |
α | 90° |
β | 90° |
γ | 90° |
Cell volume | 3893.9 ± 0.9 Å3 |
Cell temperature | 203 ± 2 K |
Ambient diffraction temperature | 203 ± 2 K |
Number of distinct elements | 4 |
Space group number | 114 |
Hermann-Mauguin space group symbol | P -4 21 c |
Hall space group symbol | P -4 2n |
Residual factor for all reflections | 0.0782 |
Residual factor for significantly intense reflections | 0.0621 |
Weighted residual factors for significantly intense reflections | 0.1152 |
Weighted residual factors for all reflections included in the refinement | 0.1206 |
Goodness-of-fit parameter for all reflections included in the refinement | 1.15 |
Diffraction radiation wavelength | 0.71073 Å |
Diffraction radiation type | MoKα |