Information card for entry 4308239
Formula | C34 H45 Cu N2 S |
Calculated formula | C34 H45 Cu N2 S |
SMILES | [Cu](SCc1ccccc1)=C1N(CCN1c1c(cccc1C(C)C)C(C)C)c1c(cccc1C(C)C)C(C)C |
Title of publication | Addition of S-H Bonds across Electron-Deficient Olefins Catalyzed by Well-Defined Copper(I) Thiolate Complexes |
Authors of publication | Samuel A. Delp; Colleen Munro-Leighton; Laurel A. Goj; Magaly A. Ramírez; T. Brent Gunnoe; Jeffrey L. Petersen; Paul D. Boyle |
Journal of publication | Inorganic Chemistry |
Year of publication | 2007 |
Journal volume | 46 |
Pages of publication | 2365 - 2367 |
a | 10.7453 ± 0.0007 Å |
b | 19.7533 ± 0.0013 Å |
c | 16.1033 ± 0.001 Å |
α | 90° |
β | 106.24 ± 0.001° |
γ | 90° |
Cell volume | 3281.6 ± 0.4 Å3 |
Cell temperature | 293 ± 2 K |
Ambient diffraction temperature | 293 ± 2 K |
Number of distinct elements | 5 |
Space group number | 14 |
Hermann-Mauguin space group symbol | P 1 21/n 1 |
Hall space group symbol | -P 2yn |
Residual factor for all reflections | 0.1265 |
Residual factor for significantly intense reflections | 0.0551 |
Weighted residual factors for significantly intense reflections | 0.1297 |
Weighted residual factors for all reflections included in the refinement | 0.1578 |
Goodness-of-fit parameter for all reflections included in the refinement | 0.99 |
Diffraction radiation wavelength | 0.71073 Å |
Diffraction radiation type | MoKα |
Duplicate of | 4308234 |