Information card for entry 4308269
Common name | CoHA-BPDS-MeCN |
Formula | C40 H74 Co2 N14 O22 S6 |
Calculated formula | C40 H64 Co2 N14 O22 S6 |
Title of publication | Hydrogen-Bonded Metal-Complex Sulfonate (MCS) Inclusion Compounds: Effect of the Guest Molecule on the Host Framework |
Authors of publication | Xin-Yi Wang; Rachelle Justice; Slavi C. Sevov |
Journal of publication | Inorganic Chemistry |
Year of publication | 2007 |
Journal volume | 46 |
Pages of publication | 4626 - 4631 |
a | 7.7896 ± 0.0003 Å |
b | 13.1339 ± 0.0005 Å |
c | 15.6698 ± 0.0005 Å |
α | 100.318 ± 0.002° |
β | 93.647 ± 0.002° |
γ | 96.525 ± 0.002° |
Cell volume | 1561.21 ± 0.1 Å3 |
Cell temperature | 100 ± 2 K |
Ambient diffraction temperature | 100 ± 2 K |
Number of distinct elements | 6 |
Space group number | 2 |
Hermann-Mauguin space group symbol | P -1 |
Hall space group symbol | -P 1 |
Residual factor for all reflections | 0.0851 |
Residual factor for significantly intense reflections | 0.0715 |
Weighted residual factors for significantly intense reflections | 0.1862 |
Weighted residual factors for all reflections included in the refinement | 0.1902 |
Goodness-of-fit parameter for all reflections included in the refinement | 1.124 |
Diffraction radiation wavelength | 0.71073 Å |
Diffraction radiation type | MoKα |