Information card for entry 4308286
Formula | C8 H12 Ag4 Mo8 N12 O26 |
Calculated formula | C8 H12 Ag4 Mo8 N12 O26 |
Title of publication | Construction of Ag/1,2,4-Triazole/Polyoxometalates Hybrid Family Varying from Diverse Supramolecular Assemblies to 3-D Rod-Packing Framework |
Authors of publication | Quan-Guo Zhai; Xiao-Yuan Wu; Shu-Mei Chen; Zhen-Guo Zhao; Can-Zhong Lu |
Journal of publication | Inorganic Chemistry |
Year of publication | 2007 |
Journal volume | 46 |
Pages of publication | 5046 - 5058 |
a | 7.8389 ± 0.0006 Å |
b | 9.9999 ± 0.0007 Å |
c | 11.6357 ± 0.0009 Å |
α | 106.616 ± 0.001° |
β | 102.63 ± 0.002° |
γ | 100.051 ± 0.003° |
Cell volume | 825 ± 0.11 Å3 |
Cell temperature | 293 ± 2 K |
Ambient diffraction temperature | 293 ± 2 K |
Number of distinct elements | 6 |
Space group number | 2 |
Hermann-Mauguin space group symbol | P -1 |
Hall space group symbol | -P 1 |
Residual factor for all reflections | 0.0307 |
Residual factor for significantly intense reflections | 0.0261 |
Weighted residual factors for significantly intense reflections | 0.0622 |
Weighted residual factors for all reflections included in the refinement | 0.0652 |
Goodness-of-fit parameter for all reflections included in the refinement | 1.024 |
Diffraction radiation wavelength | 0.71073 Å |
Diffraction radiation type | MoKα |