Information card for entry 4308289
Formula | C16 H16 Ag12 Mo8 N24 O30 |
Calculated formula | C16 H16 Ag12 Mo8 N24 O30 |
Title of publication | Construction of Ag/1,2,4-Triazole/Polyoxometalates Hybrid Family Varying from Diverse Supramolecular Assemblies to 3-D Rod-Packing Framework |
Authors of publication | Quan-Guo Zhai; Xiao-Yuan Wu; Shu-Mei Chen; Zhen-Guo Zhao; Can-Zhong Lu |
Journal of publication | Inorganic Chemistry |
Year of publication | 2007 |
Journal volume | 46 |
Pages of publication | 5046 - 5058 |
a | 9.7391 ± 0.0006 Å |
b | 11.0838 ± 0.0006 Å |
c | 13.737 ± 0.0008 Å |
α | 72.323 ± 0.001° |
β | 84.384 ± 0.001° |
γ | 73.71° |
Cell volume | 1355.99 ± 0.14 Å3 |
Cell temperature | 293 ± 2 K |
Ambient diffraction temperature | 293 ± 2 K |
Number of distinct elements | 6 |
Space group number | 2 |
Hermann-Mauguin space group symbol | P -1 |
Hall space group symbol | -P 1 |
Residual factor for all reflections | 0.0702 |
Residual factor for significantly intense reflections | 0.0599 |
Weighted residual factors for significantly intense reflections | 0.1328 |
Weighted residual factors for all reflections included in the refinement | 0.1418 |
Goodness-of-fit parameter for all reflections included in the refinement | 1.061 |
Diffraction radiation wavelength | 0.71073 Å |
Diffraction radiation type | MoKα |