Information card for entry 4311303
Formula | C36 H45 B2 F8 Fe2 N20 |
Calculated formula | C36 H45 B2 F8 Fe2 N20 |
Title of publication | Supramolecular Spin-Crossover Iron Complexes Based on Imidazole-Imidazolate Hydrogen Bonds |
Authors of publication | Yukinari Sunatsuki; Hiromi Ohta; Masaaki Kojima; Yuichi Ikuta; Yoshiyuki Goto; Naohide Matsumoto; Seiichiro Iijima; Haruo Akashi; Sumio Kaizaki; Françoise Dahan; Jean-Pierre Tuchagues |
Journal of publication | Inorganic Chemistry |
Year of publication | 2004 |
Journal volume | 43 |
Pages of publication | 4154 - 4171 |
a | 11.9678 ± 0.0011 Å |
b | 11.9678 ± 0.0011 Å |
c | 28.5739 ± 0.0014 Å |
α | 90° |
β | 90° |
γ | 120° |
Cell volume | 3544.3 ± 0.5 Å3 |
Cell temperature | 300 ± 2 K |
Ambient diffraction temperature | 300 ± 2 K |
Number of distinct elements | 6 |
Space group number | 143 |
Hermann-Mauguin space group symbol | P 3 |
Hall space group symbol | P 3 |
Residual factor for all reflections | 0.0539 |
Residual factor for significantly intense reflections | 0.043 |
Weighted residual factors for significantly intense reflections | 0.1056 |
Weighted residual factors for all reflections included in the refinement | 0.1104 |
Goodness-of-fit parameter for all reflections included in the refinement | 1.12 |
Diffraction radiation wavelength | 0.71073 Å |
Diffraction radiation type | MoKα |