Information card for entry 4311393
Formula | C26 H18 La N13 O |
Calculated formula | C26 H16 La N13 O |
Title of publication | Two Series of Novel Rare Earth Complexes with Dicyanamide [Ln(dca)2(phen)2(H2O)3][dca].(phen), (Ln = Pr, Gd, and Sm) and [Ln(dca)3(2,2'-bipy)2(H2O)]n, (Ln = Gd, Sm, and La): Syntheses, Crystal Structures, and Magnetic Properties |
Authors of publication | A-Qing Wu; Fa-Kun Zheng; Wen-Tong Chen; Li-Zhen Cai; Guo-Cong Guo; Jin-Shun Huang; Zhen-Chao Dong; Yoshihiko Takano |
Journal of publication | Inorganic Chemistry |
Year of publication | 2004 |
Journal volume | 43 |
Pages of publication | 4839 - 4845 |
a | 11.2806 ± 0.0006 Å |
b | 15.8467 ± 0.0009 Å |
c | 16.1837 ± 0.001 Å |
α | 90° |
β | 90° |
γ | 90° |
Cell volume | 2893 ± 0.3 Å3 |
Cell temperature | 293 ± 2 K |
Ambient diffraction temperature | 293 ± 2 K |
Number of distinct elements | 5 |
Space group number | 52 |
Hermann-Mauguin space group symbol | P n n a |
Hall space group symbol | -P 2a 2bc |
Residual factor for all reflections | 0.0574 |
Residual factor for significantly intense reflections | 0.0545 |
Weighted residual factors for significantly intense reflections | 0.1899 |
Weighted residual factors for all reflections included in the refinement | 0.1935 |
Goodness-of-fit parameter for all reflections included in the refinement | 1.083 |
Diffraction radiation wavelength | 0.71073 Å |
Diffraction radiation type | MoKα |