Information card for entry 4311395
Common name | 99011Z |
Formula | C63 H64 F6 N2 P3 Rh |
Calculated formula | C63 H64 F6 N2 P3 Rh |
Title of publication | Imine Hydrolysis and Role of a Rhodium(I)-Imine-Amine Complex in Homogeneous H2-Hydrogenation of the Imine and a Rare Example of Inequivalent NH2 Protons |
Authors of publication | Paolo Marcazzan; Chalil Abu-Gnim; Kapila N. Seneviratne; Brian R. James |
Journal of publication | Inorganic Chemistry |
Year of publication | 2004 |
Journal volume | 43 |
Pages of publication | 4820 - 4824 |
a | 11.5104 ± 0.0014 Å |
b | 19.986 ± 0.002 Å |
c | 25.219 ± 0.004 Å |
α | 90° |
β | 99.299 ± 0.009° |
γ | 90° |
Cell volume | 5725.3 ± 1.3 Å3 |
Cell temperature | 173 ± 2 K |
Ambient diffraction temperature | 173 ± 2 K |
Number of distinct elements | 6 |
Space group number | 14 |
Hermann-Mauguin space group symbol | P 1 21/c 1 |
Hall space group symbol | -P 2ybc |
Residual factor for all reflections | 0.066 |
Residual factor for significantly intense reflections | 0.0415 |
Weighted residual factors for significantly intense reflections | 0.097 |
Weighted residual factors for all reflections included in the refinement | 0.1096 |
Goodness-of-fit parameter for all reflections included in the refinement | 1.016 |
Diffraction radiation wavelength | 0.71073 Å |
Diffraction radiation type | MoKα |