Information card for entry 4312921
Formula | C13 H8 Ag F3 N4 O4 S |
Calculated formula | C13 H8 Ag F3 N4 O4 S |
Title of publication | Synthesis and Characterization of New Coordination Polymers Generated from Oxadiazole-Containing Organic Ligands and Inorganic Silver(I) Salts |
Authors of publication | Yu-Bin Dong; Jian-Ping Ma; Ru-Qi Huang; Mark D. Smith; Hans-Conrad zur Loye |
Journal of publication | Inorganic Chemistry |
Year of publication | 2003 |
Journal volume | 42 |
Pages of publication | 294 - 300 |
a | 10.1231 ± 0.0007 Å |
b | 13.834 ± 0.001 Å |
c | 13.9284 ± 0.001 Å |
α | 116.73 ± 0.001° |
β | 94.689 ± 0.001° |
γ | 108.754 ± 0.001° |
Cell volume | 1589.4 ± 0.2 Å3 |
Cell temperature | 293 ± 2 K |
Ambient diffraction temperature | 293 ± 2 K |
Number of distinct elements | 7 |
Space group number | 2 |
Hermann-Mauguin space group symbol | P -1 |
Hall space group symbol | -P 1 |
Residual factor for all reflections | 0.0351 |
Residual factor for significantly intense reflections | 0.0286 |
Weighted residual factors for significantly intense reflections | 0.0642 |
Weighted residual factors for all reflections included in the refinement | 0.066 |
Goodness-of-fit parameter for all reflections included in the refinement | 1.014 |
Diffraction radiation wavelength | 0.71073 Å |
Diffraction radiation type | MoKα |