Information card for entry 4314724
Formula | C24 H56 N2 P4 Pb Se2 Te2 |
Calculated formula | C24 H56 N2 P4 Pb Se2 Te2 |
Title of publication | Synthesis, Structures, and Multinuclear NMR Spectra of Tin(II) and Lead(II) Complexes of Tellurium-Containing Imidodiphosphinate Ligands: Preparation of Two Morphologies of Phase-Pure PbTe from a Single-Source Precursor |
Authors of publication | Jamie S. Ritch; Tristram Chivers; Kibriya Ahmad; Mohammad Afzaal; Paul O'Brien |
Journal of publication | Inorganic Chemistry |
Year of publication | 2010 |
Journal volume | 49 |
Pages of publication | 1198 - 1205 |
a | 34.625 ± 0.007 Å |
b | 9.7284 ± 0.0019 Å |
c | 25.834 ± 0.005 Å |
α | 90° |
β | 120.15 ± 0.03° |
γ | 90° |
Cell volume | 7525 ± 3 Å3 |
Cell temperature | 173 ± 2 K |
Ambient diffraction temperature | 173 ± 2 K |
Number of distinct elements | 7 |
Space group number | 15 |
Hermann-Mauguin space group symbol | C 1 2/c 1 |
Hall space group symbol | -C 2yc |
Residual factor for all reflections | 0.062 |
Residual factor for significantly intense reflections | 0.0595 |
Weighted residual factors for significantly intense reflections | 0.1606 |
Weighted residual factors for all reflections included in the refinement | 0.1638 |
Goodness-of-fit parameter for all reflections included in the refinement | 1.085 |
Diffraction radiation wavelength | 0.71073 Å |
Diffraction radiation type | MoKα |