Information card for entry 4314745
Formula | C19 H9 F9 N6 Pt |
Calculated formula | C19 H9 F9 N6 Pt |
Title of publication | Mono- versus Dinuclear Pt(II) 6-(5-Trifluoromethyl-Pyrazol-3-yl)-2,2'-Bipyridine Complexes: Synthesis, Characterization, and Remarkable Difference in Luminescent Properties |
Authors of publication | Kang-Wei Wang; Jing-Lin Chen; Yi-Ming Cheng; Min-Wen Chung; Cheng-Chih Hsieh; Gene-Hsiang Lee; Pi-Tai Chou; Kellen Chen; Yun Chi |
Journal of publication | Inorganic Chemistry |
Year of publication | 2010 |
Journal volume | 49 |
Pages of publication | 1372 - 1383 |
a | 8.0916 ± 0.0006 Å |
b | 14.4245 ± 0.001 Å |
c | 18.0577 ± 0.0012 Å |
α | 90° |
β | 102.31 ± 0.002° |
γ | 90° |
Cell volume | 2059.2 ± 0.3 Å3 |
Cell temperature | 150 ± 2 K |
Ambient diffraction temperature | 150 ± 2 K |
Number of distinct elements | 5 |
Space group number | 14 |
Hermann-Mauguin space group symbol | P 1 21/c 1 |
Hall space group symbol | -P 2ybc |
Residual factor for all reflections | 0.0833 |
Residual factor for significantly intense reflections | 0.057 |
Weighted residual factors for significantly intense reflections | 0.1104 |
Weighted residual factors for all reflections included in the refinement | 0.1199 |
Goodness-of-fit parameter for all reflections included in the refinement | 1.137 |
Diffraction radiation wavelength | 0.71073 Å |
Diffraction radiation type | MoKα |