Information card for entry 4314797
Formula | C32 H35 Cl4 F3 P2 Pt S2 |
Calculated formula | C32 H35 Cl4 F3 P2 Pt S2 |
SMILES | [Pd]1(Cl)([S](C)CC[P]1(c1ccccc1)c1ccccc1)[P](CCSCC(F)(F)F)(c1ccccc1)c1ccccc1.[Cl-].ClCCl |
Title of publication | Selective Formation of Heteroligated Pt(II) Complexes with Bidentate Phosphine-Thioether (P,S) and Phosphine-Selenoether (P,Se) Ligands via the Halide-Induced Ligand Rearrangement Reaction |
Authors of publication | Alexander M. Spokoyny; Mari S. Rosen; Pirmin A. Ulmann; Charlotte Stern; Chad A. Mirkin |
Journal of publication | Inorganic Chemistry |
Year of publication | 2010 |
Journal volume | 49 |
Pages of publication | 1577 - 1586 |
a | 9.526 ± 0.0003 Å |
b | 12.7111 ± 0.0003 Å |
c | 15.8835 ± 0.0004 Å |
α | 108.108 ± 0.002° |
β | 90.648 ± 0.001° |
γ | 100.085 ± 0.001° |
Cell volume | 1795.32 ± 0.09 Å3 |
Cell temperature | 100 ± 2 K |
Ambient diffraction temperature | 100 ± 2 K |
Number of distinct elements | 7 |
Space group number | 2 |
Hermann-Mauguin space group symbol | P -1 |
Hall space group symbol | -P 1 |
Residual factor for all reflections | 0.0633 |
Residual factor for significantly intense reflections | 0.0502 |
Weighted residual factors for significantly intense reflections | 0.1251 |
Weighted residual factors for all reflections included in the refinement | 0.1293 |
Goodness-of-fit parameter for all reflections included in the refinement | 1.115 |
Diffraction radiation wavelength | 0.71073 Å |
Diffraction radiation type | MoKα |