Information card for entry 4314803
Formula | C60 H68 B F24 N O P2 Pd |
Calculated formula | C60 H68 B F24 N O P2 Pd |
Title of publication | Cationic, Neutral, and Anionic PNP PdII and PtII Complexes: Dearomatization by Deprotonation and Double-Deprotonation of Pincer Systems |
Authors of publication | Moran Feller; Eyal Ben-Ari; Mark A. Iron; Yael Diskin-Posner; Gregory Leitus; Linda J. W. Shimon; Leonid Konstantinovski; David Milstein |
Journal of publication | Inorganic Chemistry |
Year of publication | 2010 |
Journal volume | 49 |
Pages of publication | 1615 - 1625 |
a | 13.583 ± 0.003 Å |
b | 24.177 ± 0.005 Å |
c | 20.219 ± 0.004 Å |
α | 90° |
β | 98.4 ± 0.03° |
γ | 90° |
Cell volume | 6569 ± 2 Å3 |
Cell temperature | 120 ± 2 K |
Ambient diffraction temperature | 120 ± 2 K |
Number of distinct elements | 8 |
Space group number | 14 |
Hermann-Mauguin space group symbol | P 1 21/c 1 |
Hall space group symbol | -P 2ybc |
Residual factor for all reflections | 0.0886 |
Residual factor for significantly intense reflections | 0.0532 |
Weighted residual factors for significantly intense reflections | 0.1204 |
Weighted residual factors for all reflections included in the refinement | 0.1355 |
Goodness-of-fit parameter for all reflections included in the refinement | 1.051 |
Diffraction radiation wavelength | 0.71073 Å |
Diffraction radiation type | MoKα |