Information card for entry 4314821
Common name | [ReO3(tacn)] |
Formula | C6 H15 N3 O3.5 Re |
Calculated formula | C6 H15 N3 O3.5 Re |
Title of publication | Triazacyclohexane (tach) Complexes of High-Valent Rhenium: Syntheses of [(R3tach)ReO3]+ (R = -CH3, -CH2C6H5) and Its Substitution Reactions |
Authors of publication | Henrik Braband; Sebastian Imstepf; Michael Felber; Bernhard Spingler; Roger Alberto |
Journal of publication | Inorganic Chemistry |
Year of publication | 2010 |
Journal volume | 49 |
Pages of publication | 1283 - 1285 |
a | 6.7113 ± 0.0002 Å |
b | 9.9641 ± 0.0004 Å |
c | 15.157 ± 0.0005 Å |
α | 90° |
β | 90.458 ± 0.003° |
γ | 90° |
Cell volume | 1013.55 ± 0.06 Å3 |
Cell temperature | 183 ± 2 K |
Ambient diffraction temperature | 183 ± 2 K |
Number of distinct elements | 5 |
Space group number | 14 |
Hermann-Mauguin space group symbol | P 1 21/c 1 |
Hall space group symbol | -P 2ybc |
Residual factor for all reflections | 0.0588 |
Residual factor for significantly intense reflections | 0.0299 |
Weighted residual factors for significantly intense reflections | 0.0382 |
Weighted residual factors for all reflections included in the refinement | 0.0415 |
Goodness-of-fit parameter for all reflections included in the refinement | 0.923 |
Diffraction radiation wavelength | 0.71073 Å |
Diffraction radiation type | MoKα |