Information card for entry 4314844
Formula | C42.35 H44.6 Au Cl1.1 F6 N2 O0.45 P2 S2 |
Calculated formula | C42.35 H44.6 Au Cl1.1 F6 N2 O0.45 P2 S2 |
Title of publication | The Use of Imidazolium-2-dithiocarboxylates in the Formation of Gold(I) Complexes and Gold Nanoparticles |
Authors of publication | Saira Naeem; Lionel Delaude; Andrew J. P. White; James D. E. T. Wilton-Ely |
Journal of publication | Inorganic Chemistry |
Year of publication | 2010 |
Journal volume | 49 |
Journal issue | 4 |
Pages of publication | 1784 - 1793 |
a | 13.11504 ± 0.00016 Å |
b | 13.99608 ± 0.00018 Å |
c | 24.7953 ± 0.0003 Å |
α | 90° |
β | 90° |
γ | 90° |
Cell volume | 4551.4 ± 0.1 Å3 |
Cell temperature | 173 ± 2 K |
Ambient diffraction temperature | 173 ± 2 K |
Number of distinct elements | 9 |
Space group number | 19 |
Hermann-Mauguin space group symbol | P 21 21 21 |
Hall space group symbol | P 2ac 2ab |
Residual factor for all reflections | 0.0393 |
Residual factor for significantly intense reflections | 0.0271 |
Weighted residual factors for significantly intense reflections | 0.0539 |
Weighted residual factors for all reflections included in the refinement | 0.0551 |
Goodness-of-fit parameter for all reflections included in the refinement | 0.95 |
Diffraction radiation wavelength | 0.71073 Å |
Diffraction radiation type | MoKα |