Information card for entry 4316067
Common name | Br O F2 (As F6) |
Formula | As Br F8 O |
Calculated formula | As Br F8.01 O0.99 |
Title of publication | XeF2 Coordination to a Halogen Center; Raman Spectra (n= 1, 2) and X-ray Crystal Structures (n= 2) of [BrOF2][AsF6].nXeF2 and [XOF2][AsF6] (X = Cl, Br) |
Authors of publication | David S. Brock; Jonathan J. Casalis de Pury; Hélène P. A. Mercier; Gary J. Schrobilgen; Bernard Silvi |
Journal of publication | Inorganic Chemistry |
Year of publication | 2010 |
Journal volume | 49 |
Pages of publication | 6673 - 6689 |
a | 8.6144 ± 0.0003 Å |
b | 8.6144 ± 0.0003 Å |
c | 8.6144 ± 0.0003 Å |
α | 90° |
β | 90° |
γ | 90° |
Cell volume | 639.26 ± 0.04 Å3 |
Cell temperature | 103 ± 2 K |
Ambient diffraction temperature | 103 ± 2 K |
Number of distinct elements | 4 |
Space group number | 198 |
Hermann-Mauguin space group symbol | P 21 3 |
Hall space group symbol | P 2ac 2ab 3 |
Residual factor for all reflections | 0.0218 |
Residual factor for significantly intense reflections | 0.0198 |
Weighted residual factors for significantly intense reflections | 0.0368 |
Weighted residual factors for all reflections included in the refinement | 0.037 |
Goodness-of-fit parameter for all reflections included in the refinement | 1.698 |
Diffraction radiation wavelength | 0.71073 Å |
Diffraction radiation type | MoKα |