Information card for entry 4317234
Formula | H12 In2 K6 O6 Te6 |
Calculated formula | In2 K6 O6 Te6 |
SMILES | [K+].[K+].O.[K+].O.O.[In]1([Te])([Te][In]([Te])([Te]1)[Te])[Te].[K+].[K+].O.[K+].O.O |
Title of publication | Aqueous Telluridoindate Chemistry: Water-Soluble Salts of Monomeric, Dimeric, and Trimeric In/Te Anions [InTe4]5-, [In2Te6]6-, and [In3Te10]11- |
Authors of publication | Johanna Heine; Stefanie Dehnen |
Journal of publication | Inorganic Chemistry |
Year of publication | 2010 |
Journal volume | 49 |
Pages of publication | 11216 - 11222 |
a | 8.993 ± 0.003 Å |
b | 14.372 ± 0.004 Å |
c | 11.602 ± 0.004 Å |
α | 90° |
β | 118.62 ± 0.03° |
γ | 90° |
Cell volume | 1316.3 ± 0.8 Å3 |
Cell temperature | 100 ± 2 K |
Ambient diffraction temperature | 100 ± 2 K |
Number of distinct elements | 5 |
Space group number | 14 |
Hermann-Mauguin space group symbol | P 1 21/c 1 |
Hall space group symbol | -P 2ybc |
Residual factor for all reflections | 0.0289 |
Residual factor for significantly intense reflections | 0.0236 |
Weighted residual factors for significantly intense reflections | 0.0533 |
Weighted residual factors for all reflections included in the refinement | 0.0545 |
Goodness-of-fit parameter for all reflections included in the refinement | 1.023 |
Diffraction radiation wavelength | 0.71073 Å |
Diffraction radiation type | MoKα |