Information card for entry 4319889
Formula | C16 H26 B10 |
Calculated formula | C16 H26 B10 |
SMILES | [C]1234(C5=CC(=C(C5)C)C)[BH]567[BH]891[BH]1%102[BH]2%113[BH]345[BH]45%11[BH]%11%102[BH]291[BH]168[BH]734[C]5%1121C1=CC=CCC=C1 |
Title of publication | Polyhedral-Based Nonlinear Optical Materials. 3.1 Synthetic Studies of Cyclopentadiene- and Cycloheptatriene-Substituted Polyhedral Compounds: Synthesis of 1,12-[(C7H7)C2B10H10(C5H3Me2)] and Related Species |
Authors of publication | Jesse Taylor; John Caruso; Amy Newlon; Ulrich Englich; Karin Ruhlandt-Senge; James T. Spencer |
Journal of publication | Inorganic Chemistry |
Year of publication | 2001 |
Journal volume | 40 |
Pages of publication | 3381 - 3388 |
a | 7.7207 ± 0.0007 Å |
b | 15.873 ± 0.0014 Å |
c | 15.5493 ± 0.0013 Å |
α | 90° |
β | 99.146 ± 0.002° |
γ | 90° |
Cell volume | 1881.4 ± 0.3 Å3 |
Cell temperature | 95 ± 2 K |
Ambient diffraction temperature | 95 ± 2 K |
Number of distinct elements | 3 |
Space group number | 14 |
Hermann-Mauguin space group symbol | P 1 21/c 1 |
Hall space group symbol | -P 2ybc |
Residual factor for all reflections | 0.1143 |
Residual factor for significantly intense reflections | 0.0761 |
Weighted residual factors for significantly intense reflections | 0.205 |
Weighted residual factors for all reflections included in the refinement | 0.2317 |
Goodness-of-fit parameter for all reflections included in the refinement | 1.034 |
Diffraction radiation wavelength | 0.71073 Å |
Diffraction radiation type | MoKα |