Information card for entry 4320385
Chemical name | catena-(mu-oxalato)-bis(3-aminopyridine)-cobalt(II)-water (1/1.5) |
Formula | C12 H15 Co N4 O5.5 |
Calculated formula | C12 H12 Co N4 O5.5 |
Title of publication | Syntheses, Crystal Structures, and Magnetic Properties of One-Dimensional Oxalato-Bridged Co(II), Ni(II), and Cu(II) Complexes withn-Aminopyridine (n= 2-4) as Terminal Ligand |
Authors of publication | Oscar Castillo; Antonio Luque; Pascual Román; Francesc Lloret; Miguel Julve |
Journal of publication | Inorganic Chemistry |
Year of publication | 2001 |
Journal volume | 40 |
Pages of publication | 5526 - 5535 |
a | 12.318 ± 0.003 Å |
b | 13.014 ± 0.002 Å |
c | 18.675 ± 0.002 Å |
α | 90° |
β | 90° |
γ | 90° |
Cell volume | 2993.7 ± 0.9 Å3 |
Cell temperature | 293 ± 2 K |
Ambient diffraction temperature | 293 ± 2 K |
Number of distinct elements | 5 |
Space group number | 52 |
Hermann-Mauguin space group symbol | P c n n |
Hall space group symbol | -P 2ab 2c |
Residual factor for all reflections | 0.2433 |
Residual factor for significantly intense reflections | 0.0859 |
Weighted residual factors for all reflections | 0.157 |
Weighted residual factors for significantly intense reflections | 0.1172 |
Goodness-of-fit parameter for all reflections | 1.754 |
Goodness-of-fit parameter for significantly intense reflections | 1.309 |
Diffraction radiation wavelength | 0.71069 Å |
Diffraction radiation type | MoKα |