Information card for entry 4320400
Formula | C74 H72 F42 N2 Pt2 S6 |
Calculated formula | C74 H72 F42 N2 Pt2 S6 |
Title of publication | Dynamic Study of Homoleptic Bimetallic Platinum(II) Complexes Bridged by Fluorinated Benzenethiolates |
Authors of publication | Guillermina Rivera; Sylvain Bernès; Cecilia Rodriguez de Barbarin; Hugo Torrens |
Journal of publication | Inorganic Chemistry |
Year of publication | 2001 |
Journal volume | 40 |
Pages of publication | 5575 - 5580 |
a | 14.282 ± 0.004 Å |
b | 22.526 ± 0.004 Å |
c | 15.2241 ± 0.0019 Å |
α | 90° |
β | 90.406 ± 0.018° |
γ | 90° |
Cell volume | 4897.7 ± 1.7 Å3 |
Cell temperature | 293 ± 2 K |
Ambient diffraction temperature | 293 ± 2 K |
Number of distinct elements | 6 |
Space group number | 14 |
Hermann-Mauguin space group symbol | P 1 21/n 1 |
Hall space group symbol | -P 2yn |
Residual factor for all reflections | 0.1598 |
Residual factor for significantly intense reflections | 0.0721 |
Weighted residual factors for significantly intense reflections | 0.1531 |
Weighted residual factors for all reflections included in the refinement | 0.1905 |
Goodness-of-fit parameter for all reflections included in the refinement | 1.007 |
Diffraction radiation probe | x-ray |
Diffraction radiation wavelength | 0.71073 Å |
Diffraction radiation type | MoKα |