Information card for entry 4320893
Common name | trigadolinium indium hexaselenide |
Formula | Gd3 In Se6 |
Calculated formula | Gd3 In Se6 |
Title of publication | Ternary Rare-Earth Selenides with the U3ScS6 Structure Type: Synthesis, Characterization, and Some Magnetic Properties of Ln3TSe6 (Ln = Sm, Gd; T = In, Cr) and Tb3CrSe6 |
Authors of publication | Olivier Tougait; James A. Ibers |
Journal of publication | Inorganic Chemistry |
Year of publication | 2000 |
Journal volume | 39 |
Pages of publication | 1790 - 1794 |
a | 14.071 ± 0.003 Å |
b | 17.286 ± 0.004 Å |
c | 4.0202 ± 0.0008 Å |
α | 90° |
β | 90° |
γ | 90° |
Cell volume | 977.8 ± 0.4 Å3 |
Cell temperature | 153 ± 2 K |
Ambient diffraction temperature | 153 ± 2 K |
Number of distinct elements | 3 |
Space group number | 58 |
Hermann-Mauguin space group symbol | P n n m |
Hall space group symbol | -P 2 2n |
Residual factor for all reflections | 0.0273 |
Residual factor for significantly intense reflections | 0.0224 |
Weighted residual factors for significantly intense reflections | 0.052 |
Weighted residual factors for all reflections included in the refinement | 0.0533 |
Goodness-of-fit parameter for all reflections included in the refinement | 1.068 |
Diffraction radiation wavelength | 0.71073 Å |
Diffraction radiation type | MoKα |