Information card for entry 4322309
Formula | C22 H16 Cl4 Cu N4 O4 Re |
Calculated formula | C22 H17 Cl4 Cu N4 O4 Re |
SMILES | [Re]1(Cl)(Cl)(Cl)(Cl)OC(=O)C(=O)O1.[Cu]12([n]3ccccc3c3cccc[n]13)[n]1ccccc1c1cccc[n]21 |
Title of publication | Synthesis, Crystal Structure, and Magnetic Properties of Tetraphenylarsonium Tetrachloro(oxalato)rhenate(IV) and Bis(2,2'-bipyridine)tetrachloro(μ-oxalato)copper(II)rhenium(IV) |
Authors of publication | Raúl Chiozzone; Ricardo González; Carlos Kremer; Giovanni De Munno; Joan Cano; Francesc Lloret; Miguel Julve; Juan Faus |
Journal of publication | Inorganic Chemistry |
Year of publication | 1999 |
Journal volume | 38 |
Pages of publication | 4745 - 4752 |
a | 9.421 ± 0.002 Å |
b | 16.909 ± 0.004 Å |
c | 16.179 ± 0.004 Å |
α | 90° |
β | 93.97 ± 0.02° |
γ | 90° |
Cell volume | 2571.1 ± 1 Å3 |
Cell temperature | 295 K |
Ambient diffraction temperature | 295 K |
Number of distinct elements | 7 |
Space group number | 14 |
Hermann-Mauguin space group symbol | P 1 21/n 1 |
Hall space group symbol | -P 2yn |
Residual factor for all reflections | 5.31 |
Residual factor for significantly intense reflections | 4.37 |
Weighted residual factors for all reflections | 6.13 |
Weighted residual factors for significantly intense reflections | 6.52 |
Goodness-of-fit parameter for significantly intense reflections | 1.54 |
Diffraction radiation wavelength | 0.71073 Å |
Diffraction radiation type | MoKα |