Information card for entry 4322325
Formula | C32 H84 F12 O4 P4 Re6 S4 Sb2 Se8 |
Calculated formula | C32 H84 F12 O4 P4 Re6 S4 Sb2 Se8 |
Title of publication | Synthesis and Structures of Solvated Monoclusters and Bridged Di- and Triclusters Based on the cubic Building Block [Re6(μ3-Se)8]2+ |
Authors of publication | Zhiping Zheng; Thomas G. Gray; R. H. Holm |
Journal of publication | Inorganic Chemistry |
Year of publication | 1999 |
Journal volume | 38 |
Pages of publication | 4888 - 4895 |
a | 11.805 ± 0.002 Å |
b | 12.065 ± 0.002 Å |
c | 24.985 ± 0.005 Å |
α | 102.39 ± 0.03° |
β | 93.74 ± 0.03° |
γ | 91.05 ± 0.03° |
Cell volume | 3466.4 ± 1.2 Å3 |
Cell temperature | 293 ± 2 K |
Ambient diffraction temperature | 293 ± 2 K |
Number of distinct elements | 9 |
Space group number | 2 |
Hermann-Mauguin space group symbol | P -1 |
Hall space group symbol | -P 1 |
Residual factor for all reflections | 0.0902 |
Residual factor for significantly intense reflections | 0.0602 |
Weighted residual factors for all reflections | 0.1575 |
Weighted residual factors for significantly intense reflections | 0.1472 |
Goodness-of-fit parameter for all reflections | 0.946 |
Goodness-of-fit parameter for significantly intense reflections | 1.109 |
Diffraction radiation wavelength | 0.71073 Å |
Diffraction radiation type | MoKα |