Information card for entry 4322341
Chemical name | Bis(trans-dichloro-bis(4-tert-butylpyridine))-di-molybdenum (II), D2h/D2d-isomers, tetrahydrofurane solvate |
Formula | C38.67 H57.33 Cl4 Mo2 N4 O0.67 |
Calculated formula | C38.6667 H57.3333 Cl4 Mo2 N4 O0.666667 |
Title of publication | Mixed Chloride/Amine Complexes of Dimolybdenum(II,II). 4. Rotational Isomers of Mo2Cl4(R-py)4 (R-py = 4-Picoline, 3,5-Lutidine, and 4-tert-Butylpyridine) |
Authors of publication | F. Albert Cotton; Evgeny V. Dikarev; Santiago Herrero; Barbara Modec |
Journal of publication | Inorganic Chemistry |
Year of publication | 1999 |
Journal volume | 38 |
Pages of publication | 4882 - 4887 |
a | 25.7267 ± 0.0009 Å |
b | 15.6628 ± 0.0008 Å |
c | 32.236 ± 0.003 Å |
α | 90° |
β | 90° |
γ | 90° |
Cell volume | 12989.6 ± 1.5 Å3 |
Cell temperature | 213 ± 2 K |
Ambient diffraction temperature | 213 ± 2 K |
Number of distinct elements | 6 |
Space group number | 61 |
Hermann-Mauguin space group symbol | P b c a |
Hall space group symbol | -P 2ac 2ab |
Residual factor for all reflections | 0.0531 |
Residual factor for significantly intense reflections | 0.0439 |
Weighted residual factors for all reflections | 0.1128 |
Weighted residual factors for significantly intense reflections | 0.102 |
Goodness-of-fit parameter for all reflections | 1.124 |
Goodness-of-fit parameter for significantly intense reflections | 1.11 |
Diffraction radiation wavelength | 0.71073 Å |
Diffraction radiation type | MoKα |