Information card for entry 4322343
Chemical name | Bis(trans-dichloro-bis(4-tert-butylpyridine))-di-molybdenum (II), D2-isomer, dichloromethane solvate |
Formula | C37.33 H54.67 Cl6.67 Mo2 N4 |
Calculated formula | C37.3267 H52 Cl6.65333 Mo2 N4 |
Title of publication | Mixed Chloride/Amine Complexes of Dimolybdenum(II,II). 4. Rotational Isomers of Mo2Cl4(R-py)4 (R-py = 4-Picoline, 3,5-Lutidine, and 4-tert-Butylpyridine) |
Authors of publication | F. Albert Cotton; Evgeny V. Dikarev; Santiago Herrero; Barbara Modec |
Journal of publication | Inorganic Chemistry |
Year of publication | 1999 |
Journal volume | 38 |
Pages of publication | 4882 - 4887 |
a | 26.504 ± 0.004 Å |
b | 18.069 ± 0.003 Å |
c | 32.76 ± 0.004 Å |
α | 90° |
β | 110.52 ± 0.01° |
γ | 90° |
Cell volume | 14693 ± 4 Å3 |
Cell temperature | 213 ± 2 K |
Ambient diffraction temperature | 213 ± 2 K |
Number of distinct elements | 5 |
Space group number | 15 |
Hermann-Mauguin space group symbol | C 1 2/c 1 |
Hall space group symbol | -C 2yc |
Residual factor for all reflections | 0.1303 |
Residual factor for significantly intense reflections | 0.0932 |
Weighted residual factors for all reflections | 0.2771 |
Weighted residual factors for significantly intense reflections | 0.2327 |
Goodness-of-fit parameter for all reflections | 1.088 |
Goodness-of-fit parameter for significantly intense reflections | 1.11 |
Diffraction radiation wavelength | 0.71073 Å |
Diffraction radiation type | MoKα |