Information card for entry 4322401
Formula | C44 H54 Cl4 N24 Ni4 O28 |
Calculated formula | C44 H54 Cl4 N24 Ni4 O28 |
Title of publication | Tetranuclear Copper(II) and Nickel(II) Cluster Complexes Derived by Self-Assembly from a Series of Tetradentate Diazine Ligands: Structural and Magnetic Studies |
Authors of publication | Craig J. Matthews; Karen Avery; Zhiqiang Xu; Laurence K. Thompson; Liang Zhao; David O. Miller; Kumar Biradha; Karen Poirier; Michael J. Zaworotko; Claire Wilson; Andrés E. Goeta; Judith A. K. Howard |
Journal of publication | Inorganic Chemistry |
Year of publication | 1999 |
Journal volume | 38 |
Pages of publication | 5266 - 5276 |
a | 14.368 ± 0.004 Å |
b | 25.469 ± 0.007 Å |
c | 18.479 ± 0.005 Å |
α | 90° |
β | 90° |
γ | 90° |
Cell volume | 6762 ± 3 Å3 |
Cell temperature | 100 ± 2 K |
Ambient diffraction temperature | 100 ± 2 K |
Number of distinct elements | 6 |
Space group number | 60 |
Hermann-Mauguin space group symbol | P b c n |
Hall space group symbol | -P 2n 2ab |
Residual factor for all reflections | 0.0871 |
Residual factor for significantly intense reflections | 0.0449 |
Weighted residual factors for significantly intense reflections | 0.1043 |
Weighted residual factors for all reflections included in the refinement | 0.1194 |
Goodness-of-fit parameter for all reflections included in the refinement | 1.022 |
Diffraction radiation wavelength | 0.71073 Å |
Diffraction radiation type | MoKα |