Information card for entry 4322409
Formula | C16 H15 O2 Pt S6 |
Calculated formula | C16 H15 O2 Pt S6 |
Title of publication | The First Systematic Synthesis of Heterobimetallic Dithiolene-Bridged Complexes. Synthesis and Characterization of Metal Complexes of 4-(1',2'-Ethylenedithiolate)-1,3-dithiole-2-one and Dimeric Metal Complexes of 1,2,3,4-Butadienetetrathiolate |
Authors of publication | Christopher E. Keefer; Suzanne T. Purrington; Robert D. Bereman; Paul D. Boyle |
Journal of publication | Inorganic Chemistry |
Year of publication | 1999 |
Journal volume | 38 |
Pages of publication | 5437 - 5442 |
a | 13.0388 ± 0.0004 Å |
b | 9.2048 ± 0.0003 Å |
c | 16.2384 ± 0.0005 Å |
α | 90° |
β | 97.289 ± 0.005° |
γ | 90° |
Cell volume | 1933.18 ± 0.11 Å3 |
Cell temperature | 293 K |
Ambient diffraction temperature | 293 K |
Number of distinct elements | 5 |
Space group number | 14 |
Hermann-Mauguin space group symbol | P 1 21/n 1 |
Hall space group symbol | -P 2yn |
Residual factor for all reflections | 0.035 |
Residual factor for significantly intense reflections | 0.035 |
Weighted residual factors for all reflections | 0.047 |
Weighted residual factors for significantly intense reflections | 0.046 |
Goodness-of-fit parameter for significantly intense reflections | 1.48 |
Diffraction radiation wavelength | 0.71073 Å |
Diffraction radiation type | MolybdenumKα |