Information card for entry 4322468
Formula | C36 H39 Cl6 Cu N4 O Sb |
Calculated formula | C36 H39 Cl6 Cu N4 O Sb |
Title of publication | Molecular Structures and Magnetochemistry of Two (β-Oxooctaethylchlorinato)copper(II) Derivatives: [Cu(oxoOEC)] and [Cu(oxoOEC.)]SbCl6 |
Authors of publication | Teresa J. Neal; Seong-Joo Kang; Charles E. Schulz; W. Robert Scheidt |
Journal of publication | Inorganic Chemistry |
Year of publication | 1999 |
Journal volume | 38 |
Pages of publication | 4294 - 4302 |
a | 13.063 ± 0.001 Å |
b | 14.108 ± 0.002 Å |
c | 11.486 ± 0.001 Å |
α | 93.77 ± 0.03° |
β | 102.168 ± 0.01° |
γ | 74.073 ± 0.01° |
Cell volume | 1989.7 ± 0.4 Å3 |
Cell temperature | 293 ± 2 K |
Ambient diffraction temperature | 293 ± 2 K |
Number of distinct elements | 7 |
Space group number | 2 |
Hermann-Mauguin space group symbol | P -1 |
Hall space group symbol | -P 1 |
Residual factor for all reflections | 0.048 |
Residual factor for significantly intense reflections | 0.0412 |
Weighted residual factors for all reflections | 0.1072 |
Weighted residual factors for significantly intense reflections | 0.1027 |
Goodness-of-fit parameter for all reflections | 1.09 |
Goodness-of-fit parameter for significantly intense reflections | 1.108 |
Diffraction radiation wavelength | 0.71073 Å |
Diffraction radiation type | MoKα |