Information card for entry 4322478
Formula | C16 H54 Mo12 N4 O42 Si |
Calculated formula | C16 H36 Mo12 N4 O42 Si |
Title of publication | Hydrothermal Syntheses: A Route to the Stepwise Condensation of Reduced Keggin Polyanions. From Reduced β-[HmSiMo12O40]n- Monomers to Bicapped Dimerized [Si2Mo28O84(H2O)2]6- Anions |
Authors of publication | Anne Dolbecq; Emmanuel Cadot; Dirk Eisner; Francis Sécheresse |
Journal of publication | Inorganic Chemistry |
Year of publication | 1999 |
Journal volume | 38 |
Pages of publication | 4217 - 4223 |
a | 12.793 ± 0.0002 Å |
b | 21.6171 ± 0.0002 Å |
c | 19.7222 ± 0.0002 Å |
α | 90° |
β | 96.017 ± 0.001° |
γ | 90° |
Cell volume | 5424.08 ± 0.11 Å3 |
Cell temperature | 293 ± 2 K |
Ambient diffraction temperature | 293 ± 2 K |
Number of distinct elements | 6 |
Space group number | 14 |
Hermann-Mauguin space group symbol | P 1 21/n 1 |
Hall space group symbol | -P 2yn |
Residual factor for all reflections | 0.069 |
Residual factor for significantly intense reflections | 0.0512 |
Weighted residual factors for all reflections | 0.1328 |
Weighted residual factors for significantly intense reflections | 0.1233 |
Goodness-of-fit parameter for all reflections | 1.095 |
Goodness-of-fit parameter for significantly intense reflections | 1.144 |
Diffraction radiation wavelength | 0.71073 Å |
Diffraction radiation type | MoKα |