Information card for entry 4322480
Formula | C16 H48 Mo14 N4 O44 Si |
Calculated formula | C16 H48 Mo14 N4 O44 Si |
Title of publication | Hydrothermal Syntheses: A Route to the Stepwise Condensation of Reduced Keggin Polyanions. From Reduced β-[HmSiMo12O40]n- Monomers to Bicapped Dimerized [Si2Mo28O84(H2O)2]6- Anions |
Authors of publication | Anne Dolbecq; Emmanuel Cadot; Dirk Eisner; Francis Sécheresse |
Journal of publication | Inorganic Chemistry |
Year of publication | 1999 |
Journal volume | 38 |
Pages of publication | 4217 - 4223 |
a | 12.0502 ± 0.0004 Å |
b | 11.75 ± 0.0004 Å |
c | 19.8001 ± 0.0005 Å |
α | 90° |
β | 100.525 ± 0.001° |
γ | 90° |
Cell volume | 2756.33 ± 0.15 Å3 |
Cell temperature | 293 ± 2 K |
Ambient diffraction temperature | 293 ± 2 K |
Number of distinct elements | 6 |
Space group number | 14 |
Hermann-Mauguin space group symbol | P 1 21/n 1 |
Hall space group symbol | -P 2yn |
Residual factor for all reflections | 0.1234 |
Residual factor for significantly intense reflections | 0.0711 |
Weighted residual factors for all reflections | 0.2208 |
Weighted residual factors for significantly intense reflections | 0.1852 |
Goodness-of-fit parameter for all reflections | 1.046 |
Goodness-of-fit parameter for significantly intense reflections | 1.16 |
Diffraction radiation wavelength | 0.71073 Å |
Diffraction radiation type | MoKα |