Information card for entry 4322513
Common name | [Mn(3,5-dimethylpyridine)2(N3)2]n |
Formula | C14 H18 Mn N8 |
Calculated formula | C14 H18 Mn N8 |
Title of publication | Synthesis, Structural Characterization, Magnetic Behavior, and Single Crystal EPR Spectra of Three New One-Dimensional Manganese Azido Systems with FM, Alternating FM-AF, and AF Coupling |
Authors of publication | Morsy A. M. Abu-Youssef; Albert Escuer; Dante Gatteschi; Mohamed A. S. Goher; Franz A. Mautner; Ramon Vicente |
Journal of publication | Inorganic Chemistry |
Year of publication | 1999 |
Journal volume | 38 |
Pages of publication | 5716 - 5723 |
a | 13.552 ± 0.006 Å |
b | 7.73 ± 0.003 Å |
c | 16.554 ± 0.006 Å |
α | 90° |
β | 101.69 ± 0.03° |
γ | 90° |
Cell volume | 1698.2 ± 1.2 Å3 |
Cell temperature | 295 ± 2 K |
Ambient diffraction temperature | 295 ± 2 K |
Number of distinct elements | 4 |
Space group number | 14 |
Hermann-Mauguin space group symbol | P 1 21/n 1 |
Hall space group symbol | -P 2yn |
Residual factor for all reflections | 0.0967 |
Residual factor for significantly intense reflections | 0.0617 |
Weighted residual factors for all reflections | 0.1374 |
Weighted residual factors for significantly intense reflections | 0.1225 |
Goodness-of-fit parameter for all reflections | 1.077 |
Goodness-of-fit parameter for significantly intense reflections | 1.172 |
Diffraction radiation wavelength | 0.71069 Å |
Diffraction radiation type | MoKα |