Information card for entry 4322517
Formula | C40 H61 N3 Si2 Zr |
Calculated formula | C40 H61 N3 Si2 Zr |
SMILES | [Zr]1([N](C2CCCCC2)=C(N1C1CCCCC1)N([Si](C)(C)C)[Si](C)(C)C)(Cc1ccccc1)(Cc1ccccc1)Cc1ccccc1 |
Title of publication | N-Substituted Guanidinate Anions as Ancillary Ligands in Group 4 Chemistry. Syntheses and Characterization of M{RNC[N(SiMe3)2]NR}2Cl2, [M{CyNC[N(SiMe3)2]NCy}Cl3]- (M = Zr, Hf; R =iPr, Cy), and Zr{CyNC[N(SiMe3)2]NCy}(CH2Ph)3 |
Authors of publication | Wood; Glenn P. A. Yap; Darrin S. Richeson |
Journal of publication | Inorganic Chemistry |
Year of publication | 1999 |
Journal volume | 38 |
Pages of publication | 5788 - 5794 |
a | 10.483 ± 0.001 Å |
b | 18.889 ± 0.002 Å |
c | 20.459 ± 0.003 Å |
α | 90° |
β | 102.431 ± 0.002° |
γ | 90° |
Cell volume | 3956.2 ± 0.8 Å3 |
Cell temperature | 203 ± 2 K |
Ambient diffraction temperature | 203 ± 2 K |
Number of distinct elements | 5 |
Space group number | 14 |
Hermann-Mauguin space group symbol | P 1 21/n 1 |
Hall space group symbol | -P 2yn |
Residual factor for all reflections | 0.0878 |
Residual factor for significantly intense reflections | 0.0473 |
Weighted residual factors for significantly intense reflections | 0.0918 |
Weighted residual factors for all reflections included in the refinement | 0.1003 |
Goodness-of-fit parameter for all reflections included in the refinement | 1.027 |
Diffraction radiation wavelength | 0.71073 Å |
Diffraction radiation type | MoKα |